Weather - xfce...

Questions about applications and software
Forum rules
Before you post please read this

Weather - xfce...

Postby tenfoot on Tue Mar 24, 2009 5:15 pm

I have downloaded wview-5.2.0, the application used with XFCE to display weather information, with the intention of installing it and using with LinuxMint Felicia. However, the Make part of the installation through up errors. I attach the config.log file is the result of my efforts to do so. Is there anyone out there who can tell me what Error 1 and Error 2 mean and, even better, what I can do about resolving the problem?

zed@zed-desktop ~/Desktop/wview-5.2.0 $ make
make all-recursive
make[1]: Entering directory `/home/zed/Desktop/wview-5.2.0'
Making all in stations
make[2]: Entering directory `/home/zed/Desktop/wview-5.2.0/stations'
Making all in Simulator
make[3]: Entering directory `/home/zed/Desktop/wview-5.2.0/stations/Simulator'
gcc -DHAVE_CONFIG_H -I. -I../.. -I../../common -I../../stations/common -I/usr/local/include -DHOST_IS_BIGENDIAN=0 -D_GNU_SOURCE -DWV_CONFIG_DIR=\"/usr/local/etc/wview\" -DWV_RUN_DIR=\"/usr/local/var/wview\" -DBUILD_WVIEWD -g -O2 -MT sensor.o -MD -MP -MF .deps/sensor.Tpo -c -o sensor.o `test -f '../../common/sensor.c' || echo './'`../../common/sensor.c
../../common/sensor.c:26:23: error: radmsgLog.h: No such file or directory
In file included from ../../common/sensor.c:30:
../../common/sensor.h:39:21: error: radlist.h: No such file or directory
../../common/sensor.h:40:24: error: radbuffers.h: No such file or directory
In file included from ../../common/sensor.h:42,
from ../../common/sensor.c:30:
../../common/sysdefs.h:35:24: error: radsysdefs.h: No such file or directory
In file included from ../../common/sensor.h:42,
from ../../common/sensor.c:30:
../../common/sysdefs.h:198: error: expected ‘)’ before ‘daemonBitMask’
../../common/sysdefs.h:262: error: expected ‘)’ before ‘packedDate’
../../common/sysdefs.h:269: error: expected ‘)’ before ‘newDate’
../../common/sysdefs.h:276: error: expected ‘=’, ‘,’, ‘;’, ‘asm’ or ‘__attribute__’ before ‘wvutilsIncrementPackedTime’
In file included from ../../common/sensor.h:43,
from ../../common/sensor.c:30:
../../common/datadefs.h:217: error: expected specifier-qualifier-list before ‘USHORT’
In file included from ../../common/sensor.c:30:
../../common/sensor.h:61: error: expected specifier-qualifier-list before ‘NODE’
../../common/sensor.h:68: error: expected specifier-qualifier-list before ‘RADLIST’
../../common/sensor.c: In function ‘sensorGetLowTime’:
../../common/sensor.c:195: error: ‘PRI_MEDIUM’ undeclared (first use in this function)
../../common/sensor.c:195: error: (Each undeclared identifier is reported only once
../../common/sensor.c:195: error: for each function it appears in.)
../../common/sensor.c: In function ‘sensorGetLowDate’:
../../common/sensor.c:227: error: ‘PRI_MEDIUM’ undeclared (first use in this function)
../../common/sensor.c: In function ‘sensorGetHighTime’:
../../common/sensor.c:269: error: ‘PRI_MEDIUM’ undeclared (first use in this function)
../../common/sensor.c: In function ‘sensorGetHighDate’:
../../common/sensor.c:301: error: ‘PRI_MEDIUM’ undeclared (first use in this function)
../../common/sensor.c: In function ‘AgeAccumulator’:
../../common/sensor.c:465: error: ‘struct <anonymous>’ has no member named ‘samples’
../../common/sensor.c:467: error: ‘struct <anonymous>’ has no member named ‘samples’
../../common/sensor.c:469: error: ‘struct <anonymous>’ has no member named ‘secondsInAccumulator’
../../common/sensor.c:469: error: ‘WV_ACCUM_SAMPLE’ has no member named ‘sampleTime’
../../common/sensor.c:472: error: ‘struct <anonymous>’ has no member named ‘samples’
../../common/sensor.c: In function ‘sensorAccumInit’:
../../common/sensor.c:492: error: ‘struct <anonymous>’ has no member named ‘samples’
../../common/sensor.c:493: error: ‘struct <anonymous>’ has no member named ‘secondsInAccumulator’
../../common/sensor.c:494: error: ‘struct <anonymous>’ has no member named ‘sum’
../../common/sensor.c: In function ‘sensorAccumExit’:
../../common/sensor.c:502: error: ‘struct <anonymous>’ has no member named ‘samples’
../../common/sensor.c:504: error: ‘struct <anonymous>’ has no member named ‘samples’
../../common/sensor.c: In function ‘sensorAccumAddSample’:
../../common/sensor.c:521: error: ‘WV_ACCUM_SAMPLE’ has no member named ‘value’
../../common/sensor.c:522: error: ‘WV_ACCUM_SAMPLE’ has no member named ‘sampleTime’
../../common/sensor.c:523: error: ‘struct <anonymous>’ has no member named ‘samples’
../../common/sensor.c:523: error: ‘NODE_PTR’ undeclared (first use in this function)
../../common/sensor.c:523: error: expected ‘)’ before ‘newNode’
../../common/sensor.c: In function ‘sensorAccumGetTotal’:
../../common/sensor.c:537: error: ‘struct <anonymous>’ has no member named ‘samples’
../../common/sensor.c:539: error: ‘struct <anonymous>’ has no member named ‘samples’
../../common/sensor.c:539: error: ‘NODE_PTR’ undeclared (first use in this function)
../../common/sensor.c:539: error: expected ‘)’ before ‘nodePtr’
../../common/sensor.c:541: error: ‘WV_ACCUM_SAMPLE’ has no member named ‘value’
../../common/sensor.c: In function ‘sensorAccumGetAverage’:
../../common/sensor.c:552: error: ‘struct <anonymous>’ has no member named ‘samples’
make[3]: *** [sensor.o] Error 1
make[3]: Leaving directory `/home/zed/Desktop/wview-5.2.0/stations/Simulator'
make[2]: *** [all-recursive] Error 1
make[2]: Leaving directory `/home/zed/Desktop/wview-5.2.0/stations'
make[1]: *** [all-recursive] Error 1
make[1]: Leaving directory `/home/zed/Desktop/wview-5.2.0'
make: *** [all] Error 2
zed@zed-desktop ~/Desktop/wview-5.2.0 $
User avatar
tenfoot
Level 5
Level 5
 
Posts: 570
Joined: Sun Jun 03, 2007 4:12 am
Location: Waipapa, Bay of Islands, New Zealand

Linux Mint is funded by ads and donations.
 

Re: Weather - xfce...

Postby merlwiz79 on Wed Mar 25, 2009 5:54 am

Libraries

Note: Some of these libraries may be represented as "-dev" or similar in your
package management utility, i.e., "libcurl-dev". If they are, you should install
the dev version in order to get the development libraries that radlib/wview needs.

* libz - compression library
* libpng - png image library
* libreadline5-dev - readline library
* gawk - gnu pattern processing language
* libsqlite3 - SQLite3 database run time library - make sure the older version (2.x.y) is not installed - it may be named libsqlite0 (debian, kubuntu) or some other package name - you can only have SQLite3 libraries and development environment installed
* libsqlite3-dev - SQLite3 database development library - make sure the older version (2.x.y) is not installed - it may be named libsqlite0-dev (debian, kubuntu) or some other package name - you can only have SQLite3 libraries and development environment installed
* sqlite3 - SQLite3 database command line utility
* libgd2 - graphics drawing library - may require installation - http://www.boutell.com/gd/
* radlib - rapid application development library - must be installed with SQLite support (--enable-sqlite) - http://www.radlib.teel.ws
* libssl - secure socket library - optional, required for libcurl
* libcurl - "C" URL HTTP library - optional, required for Weather Underground or Weatherforyou - http://curl.haxx.se/libcurl/
* sendmail - email transfer agent - optional, required for email alerts
* sendEmail - command line email sending utility - optional, required for email alerts

It says nothing about xfce: http://www.wviewweather.com/
User avatar
merlwiz79
Level 11
Level 11
 
Posts: 3637
Joined: Wed Apr 04, 2007 1:50 pm
Location: Here again :)


Return to Software & Applications

Who is online

Users browsing this forum: gbvoris, Google Adsense [Bot], niowluka, noelbeth55 and 24 guests