18.3 Sylvia and VMware workstation 12

Questions about applications and software
Forum rules
Before you post please read how to get help
Post Reply
killboxalpha
Level 1
Level 1
Posts: 1
Joined: Wed Mar 07, 2018 3:11 pm

18.3 Sylvia and VMware workstation 12

Post by killboxalpha » Wed Mar 07, 2018 3:31 pm

Hi

Iam trying to install a vmware workstation 12 pro on to sylvia 18.3 but keep getting errors.

Version of vmware workstation tried: 12.5.3/12.5.9(newest-v12) i only have license for v12.

i have also tried "sudo vmware-modconfig --console --install-all" (see below for log output)

------------
System:
-------------
Kernel: 4.13.0-32-generic x86_64 (64 bit gcc: 5.4.0)
Desktop: Cinnamon 3.6.7 (Gtk 3.18.9-1ubuntu3.3) Distro: Linux Mint 18.3 Sylvia
Machine: System: Supermicro product: X8DT3
CPU(s): 2 Hexa core Intel Xeon L5640s (-HT-MCP-SMP-) cache: 24576 KB

--------------------
Error issues:
--------------------
i have installed vmware workstation, but when i launch the first
1st error: "VMware kernel module updater" ( "Before you can run VMware, several modules must be compiled and loaded into the running kernel")

after i press "install" iam required to enter a password.
2nd error: "unable to start service" ("see log file /tmp/vmware-root/vmware-x.log for details")


---------------------------------------------------------------------------------------
log from: " sudo vmware-modconfig --console --install-all "
---------------------------------------------------------------------------------------

VMware Authentication Daemon done
VM communication interface socket family done
Virtual machine communication interface done
Virtual machine monitor done
Blocking file system done
make: Entering directory '/tmp/modconfig-doTtHI/vmmon-only'
Using kernel build system.
/usr/bin/make -C /lib/modules/4.13.0-32-generic/build/include/.. SUBDIRS=$PWD SRCROOT=$PWD/. \
MODULEBUILDDIR= modules
make[1]: Entering directory '/usr/src/linux-headers-4.13.0-32-generic'
CC [M] /tmp/modconfig-doTtHI/vmmon-only/linux/driverLog.o
CC [M] /tmp/modconfig-doTtHI/vmmon-only/linux/driver.o
CC [M] /tmp/modconfig-doTtHI/vmmon-only/linux/hostif.o
CC [M] /tmp/modconfig-doTtHI/vmmon-only/common/apic.o
CC [M] /tmp/modconfig-doTtHI/vmmon-only/common/memtrack.o
CC [M] /tmp/modconfig-doTtHI/vmmon-only/common/hashFunc.o
CC [M] /tmp/modconfig-doTtHI/vmmon-only/common/cpuid.o
CC [M] /tmp/modconfig-doTtHI/vmmon-only/common/vmx86.o
CC [M] /tmp/modconfig-doTtHI/vmmon-only/common/task.o
CC [M] /tmp/modconfig-doTtHI/vmmon-only/common/comport.o
CC [M] /tmp/modconfig-doTtHI/vmmon-only/common/phystrack.o
CC [M] /tmp/modconfig-doTtHI/vmmon-only/vmcore/moduleloop.o
In file included from /tmp/modconfig-doTtHI/vmmon-only/common/vmx86.h:32:0,
from /tmp/modconfig-doTtHI/vmmon-only/common/vmx86.c:43:
/tmp/modconfig-doTtHI/vmmon-only/./include/x86msr.h:109:0: warning: "MSR_MISC_FEATURES_ENABLES" redefined
#define MSR_MISC_FEATURES_ENABLES 0x140
^
In file included from ./arch/x86/include/asm/msr.h:4:0,
from ./arch/x86/include/asm/processor.h:20,
from ./arch/x86/include/asm/cpufeature.h:4,
from ./arch/x86/include/asm/thread_info.h:63,
from ./include/linux/thread_info.h:37,
from ./arch/x86/include/asm/preempt.h:6,
from ./include/linux/preempt.h:80,
from ./include/linux/rcupdate.h:40,
from ./include/linux/rculist.h:10,
from ./include/linux/pid.h:4,
from ./include/linux/sched.h:13,
from /tmp/modconfig-doTtHI/vmmon-only/common/vmx86.c:31:
./arch/x86/include/asm/msr-index.h:578:0: note: this is the location of the previous definition
#define MSR_MISC_FEATURES_ENABLES 0x00000140
^
In file included from /tmp/modconfig-doTtHI/vmmon-only/./include/vm_asm_x86.h:41:0,
from /tmp/modconfig-doTtHI/vmmon-only/./include/vm_asm_x86_64.h:39,
from /tmp/modconfig-doTtHI/vmmon-only/./include/vm_asm.h:46,
from /tmp/modconfig-doTtHI/vmmon-only/common/vmx86.c:46:
/tmp/modconfig-doTtHI/vmmon-only/./include/x86_basic_defs.h:65:0: warning: "CR3_PCID_MASK" redefined
#define CR3_PCID_MASK 0xFFF
^
In file included from ./arch/x86/include/asm/irqflags.h:4:0,
from ./include/linux/irqflags.h:15,
from ./include/linux/rcupdate.h:39,
from ./include/linux/rculist.h:10,
from ./include/linux/pid.h:4,
from ./include/linux/sched.h:13,
from /tmp/modconfig-doTtHI/vmmon-only/common/vmx86.c:31:
./arch/x86/include/asm/processor-flags.h:37:0: note: this is the location of the previous definition
#define CR3_PCID_MASK 0xFFFull
^
In file included from /tmp/modconfig-doTtHI/vmmon-only/./common/vmx86.h:32:0,
from /tmp/modconfig-doTtHI/vmmon-only/vmcore/moduleloop.c:35:
/tmp/modconfig-doTtHI/vmmon-only/./include/x86msr.h:109:0: warning: "MSR_MISC_FEATURES_ENABLES" redefined
#define MSR_MISC_FEATURES_ENABLES 0x140
^
In file included from ./arch/x86/include/asm/msr.h:4:0,
from ./arch/x86/include/asm/processor.h:20,
from ./arch/x86/include/asm/cpufeature.h:4,
from ./arch/x86/include/asm/thread_info.h:63,
from ./include/linux/thread_info.h:37,
from ./arch/x86/include/asm/preempt.h:6,
from ./include/linux/preempt.h:80,
from ./include/linux/rcupdate.h:40,
from ./include/linux/rculist.h:10,
from ./include/linux/pid.h:4,
from ./include/linux/sched.h:13,
from /tmp/modconfig-doTtHI/vmmon-only/vmcore/moduleloop.c:31:
./arch/x86/include/asm/msr-index.h:578:0: note: this is the location of the previous definition
#define MSR_MISC_FEATURES_ENABLES 0x00000140
^
In file included from /tmp/modconfig-doTtHI/vmmon-only/./include/vm_asm.h:43:0,
from /tmp/modconfig-doTtHI/vmmon-only/linux/hostif.c:80:
/tmp/modconfig-doTtHI/vmmon-only/./include/x86msr.h:109:0: warning: "MSR_MISC_FEATURES_ENABLES" redefined
#define MSR_MISC_FEATURES_ENABLES 0x140
^
In file included from ./arch/x86/include/asm/msr.h:4:0,
from ./arch/x86/include/asm/processor.h:20,
from ./arch/x86/include/asm/cpufeature.h:4,
from ./arch/x86/include/asm/thread_info.h:63,
from ./include/linux/thread_info.h:37,
from ./arch/x86/include/asm/preempt.h:6,
from ./include/linux/preempt.h:80,
from ./include/linux/spinlock.h:50,
from ./include/linux/mmzone.h:7,
from ./include/linux/gfp.h:5,
from ./include/linux/mm.h:9,
from /tmp/modconfig-doTtHI/vmmon-only/./include/compat_page.h:23,
from /tmp/modconfig-doTtHI/vmmon-only/linux/hostif.c:32:
./arch/x86/include/asm/msr-index.h:578:0: note: this is the location of the previous definition
#define MSR_MISC_FEATURES_ENABLES 0x00000140
^
In file included from /tmp/modconfig-doTtHI/vmmon-only/./common/vmx86.h:32:0,
from /tmp/modconfig-doTtHI/vmmon-only/linux/driver.h:31,
from /tmp/modconfig-doTtHI/vmmon-only/linux/driver.c:48:
/tmp/modconfig-doTtHI/vmmon-only/./include/x86msr.h:109:0: warning: "MSR_MISC_FEATURES_ENABLES" redefined
#define MSR_MISC_FEATURES_ENABLES 0x140
^
In file included from ./arch/x86/include/asm/msr.h:4:0,
from ./arch/x86/include/asm/processor.h:20,
from ./arch/x86/include/asm/cpufeature.h:4,
from ./arch/x86/include/asm/thread_info.h:63,
from ./include/linux/thread_info.h:37,
from ./arch/x86/include/asm/preempt.h:6,
from ./include/linux/preempt.h:80,
from ./include/linux/spinlock.h:50,
from ./include/linux/wait.h:8,
from ./include/linux/wait_bit.h:7,
from ./include/linux/fs.h:5,
from ./include/linux/highmem.h:4,
from /tmp/modconfig-doTtHI/vmmon-only/linux/driver.c:25:
./arch/x86/include/asm/msr-index.h:578:0: note: this is the location of the previous definition
#define MSR_MISC_FEATURES_ENABLES 0x00000140
^
In file included from /tmp/modconfig-doTtHI/vmmon-only/./include/vm_asm_x86.h:41:0,
from /tmp/modconfig-doTtHI/vmmon-only/./include/vm_asm_x86_64.h:39,
from /tmp/modconfig-doTtHI/vmmon-only/./include/vm_asm.h:46,
from /tmp/modconfig-doTtHI/vmmon-only/linux/hostif.c:80:
/tmp/modconfig-doTtHI/vmmon-only/./include/x86_basic_defs.h:65:0: warning: "CR3_PCID_MASK" redefined
#define CR3_PCID_MASK 0xFFF
^
In file included from ./arch/x86/include/asm/processor.h:4:0,
from ./arch/x86/include/asm/cpufeature.h:4,
from ./arch/x86/include/asm/thread_info.h:63,
from ./include/linux/thread_info.h:37,
from ./arch/x86/include/asm/preempt.h:6,
from ./include/linux/preempt.h:80,
from ./include/linux/spinlock.h:50,
from ./include/linux/mmzone.h:7,
from ./include/linux/gfp.h:5,
from ./include/linux/mm.h:9,
from /tmp/modconfig-doTtHI/vmmon-only/./include/compat_page.h:23,
from /tmp/modconfig-doTtHI/vmmon-only/linux/hostif.c:32:
./arch/x86/include/asm/processor-flags.h:37:0: note: this is the location of the previous definition
#define CR3_PCID_MASK 0xFFFull
^
In file included from /tmp/modconfig-doTtHI/vmmon-only/./include/vm_asm_x86.h:41:0,
from /tmp/modconfig-doTtHI/vmmon-only/./include/vm_asm_x86_64.h:39,
from /tmp/modconfig-doTtHI/vmmon-only/./include/vm_asm.h:46,
from /tmp/modconfig-doTtHI/vmmon-only/linux/driver.c:50:
/tmp/modconfig-doTtHI/vmmon-only/./include/x86_basic_defs.h:65:0: warning: "CR3_PCID_MASK" redefined
#define CR3_PCID_MASK 0xFFF
^
In file included from ./arch/x86/include/asm/processor.h:4:0,
from ./arch/x86/include/asm/cpufeature.h:4,
from ./arch/x86/include/asm/thread_info.h:63,
from ./include/linux/thread_info.h:37,
from ./arch/x86/include/asm/preempt.h:6,
from ./include/linux/preempt.h:80,
from ./include/linux/spinlock.h:50,
from ./include/linux/wait.h:8,
from ./include/linux/wait_bit.h:7,
from ./include/linux/fs.h:5,
from ./include/linux/highmem.h:4,
from /tmp/modconfig-doTtHI/vmmon-only/linux/driver.c:25:
./arch/x86/include/asm/processor-flags.h:37:0: note: this is the location of the previous definition
#define CR3_PCID_MASK 0xFFFull
^
In file included from /tmp/modconfig-doTtHI/vmmon-only/./include/pgtbl.h:25:0,
from /tmp/modconfig-doTtHI/vmmon-only/linux/hostif.c:95:
/tmp/modconfig-doTtHI/vmmon-only/./include/pgtbl.h: In function ‘PgtblPGD2PTELocked’:
/tmp/modconfig-doTtHI/vmmon-only/./include/pgtbl.h:125:28: error: passing argument 1 of ‘pud_offset’ from incompatible pointer type [-Werror=incompatible-pointer-types]
pud = compat_pud_offset(pgd, addr);
^
/tmp/modconfig-doTtHI/vmmon-only/./include/compat_pgtable.h:72:56: note: in definition of macro ‘compat_pud_offset’
# define compat_pud_offset(pgd, address) pud_offset(pgd, address)
^
In file included from ./include/linux/mm.h:70:0,
from /tmp/modconfig-doTtHI/vmmon-only/./include/compat_page.h:23,
from /tmp/modconfig-doTtHI/vmmon-only/linux/hostif.c:32:
./arch/x86/include/asm/pgtable.h:828:22: note: expected ‘p4d_t * {aka struct <anonymous> *}’ but argument is of type ‘compat_pgd_t * {aka struct <anonymous> *}’
static inline pud_t *pud_offset(p4d_t *p4d, unsigned long address)
^
/tmp/modconfig-doTtHI/vmmon-only/linux/driver.c:121:19: error: initialization from incompatible pointer type [-Werror=incompatible-pointer-types]
.fault = LinuxDriverFault
^
/tmp/modconfig-doTtHI/vmmon-only/linux/driver.c:121:19: note: (near initialization for ‘vmuser_mops.fault’)
/tmp/modconfig-doTtHI/vmmon-only/linux/driver.c:1283:1: warning: always_inline function might not be inlinable [-Wattributes]
LinuxDriverSyncReadTSCs(uint64 *delta) // OUT: TSC max - TSC min
^
/tmp/modconfig-doTtHI/vmmon-only/linux/hostif.c: In function ‘HostIFFastClockThread’:
/tmp/modconfig-doTtHI/vmmon-only/linux/hostif.c:3265:4: error: implicit declaration of function ‘allow_signal’ [-Werror=implicit-function-declaration]
allow_signal(SIGKILL);
^
/tmp/modconfig-doTtHI/vmmon-only/linux/hostif.c: In function ‘HostIF_SetFastClockRate’:
/tmp/modconfig-doTtHI/vmmon-only/linux/hostif.c:3419:10: error: implicit declaration of function ‘force_sig’ [-Werror=implicit-function-declaration]
force_sig(SIGKILL, linuxState.fastClockThread);
^
/tmp/modconfig-doTtHI/vmmon-only/linux/driver.c: In function ‘LinuxDriver_Ioctl’:
/tmp/modconfig-doTtHI/vmmon-only/linux/driver.c:1981:1: warning: the frame size of 1168 bytes is larger than 1024 bytes [-Wframe-larger-than=]
}
^
cc1: some warnings being treated as errors
scripts/Makefile.build:308: recipe for target '/tmp/modconfig-doTtHI/vmmon-only/linux/driver.o' failed
make[2]: *** [/tmp/modconfig-doTtHI/vmmon-only/linux/driver.o] Error 1
make[2]: *** Waiting for unfinished jobs....
cc1: some warnings being treated as errors
scripts/Makefile.build:308: recipe for target '/tmp/modconfig-doTtHI/vmmon-only/linux/hostif.o' failed
make[2]: *** [/tmp/modconfig-doTtHI/vmmon-only/linux/hostif.o] Error 1
Makefile:1550: recipe for target '_module_/tmp/modconfig-doTtHI/vmmon-only' failed
make[1]: *** [_module_/tmp/modconfig-doTtHI/vmmon-only] Error 2
make[1]: Leaving directory '/usr/src/linux-headers-4.13.0-32-generic'
Makefile:120: recipe for target 'vmmon.ko' failed
make: *** [vmmon.ko] Error 2
make: Leaving directory '/tmp/modconfig-doTtHI/vmmon-only'
make: Entering directory '/tmp/modconfig-doTtHI/vmnet-only'
Using kernel build system.
/usr/bin/make -C /lib/modules/4.13.0-32-generic/build/include/.. SUBDIRS=$PWD SRCROOT=$PWD/. \
MODULEBUILDDIR= modules
make[1]: Entering directory '/usr/src/linux-headers-4.13.0-32-generic'
CC [M] /tmp/modconfig-doTtHI/vmnet-only/driver.o
CC [M] /tmp/modconfig-doTtHI/vmnet-only/hub.o
CC [M] /tmp/modconfig-doTtHI/vmnet-only/userif.o
CC [M] /tmp/modconfig-doTtHI/vmnet-only/netif.o
CC [M] /tmp/modconfig-doTtHI/vmnet-only/bridge.o
CC [M] /tmp/modconfig-doTtHI/vmnet-only/procfs.o
CC [M] /tmp/modconfig-doTtHI/vmnet-only/smac_compat.o
CC [M] /tmp/modconfig-doTtHI/vmnet-only/smac.o
CC [M] /tmp/modconfig-doTtHI/vmnet-only/vnetEvent.o
CC [M] /tmp/modconfig-doTtHI/vmnet-only/vnetUserListener.o
/tmp/modconfig-doTtHI/vmnet-only/userif.c: In function ‘VNetUserIfRead’:
/tmp/modconfig-doTtHI/vmnet-only/userif.c:746:11: error: implicit declaration of function ‘signal_pending’ [-Werror=implicit-function-declaration]
if (signal_pending(current)) {
^
In file included from /tmp/modconfig-doTtHI/vmnet-only/net.h:38:0,
from /tmp/modconfig-doTtHI/vmnet-only/vnetInt.h:26,
from /tmp/modconfig-doTtHI/vmnet-only/bridge.c:52:
/tmp/modconfig-doTtHI/vmnet-only/vm_device_version.h:56:0: warning: "PCI_VENDOR_ID_VMWARE" redefined
#define PCI_VENDOR_ID_VMWARE 0x15AD
^
In file included from ./include/linux/pci.h:36:0,
from /tmp/modconfig-doTtHI/vmnet-only/compat_netdevice.h:27,
from /tmp/modconfig-doTtHI/vmnet-only/bridge.c:51:
./include/linux/pci_ids.h:2260:0: note: this is the location of the previous definition
#define PCI_VENDOR_ID_VMWARE 0x15ad
^
In file included from /tmp/modconfig-doTtHI/vmnet-only/net.h:38:0,
from /tmp/modconfig-doTtHI/vmnet-only/vnetInt.h:26,
from /tmp/modconfig-doTtHI/vmnet-only/bridge.c:52:
/tmp/modconfig-doTtHI/vmnet-only/vm_device_version.h:73:0: warning: "PCI_DEVICE_ID_VMWARE_VMXNET3" redefined
#define PCI_DEVICE_ID_VMWARE_VMXNET3 0x07B0
^
In file included from ./include/linux/pci.h:36:0,
from /tmp/modconfig-doTtHI/vmnet-only/compat_netdevice.h:27,
from /tmp/modconfig-doTtHI/vmnet-only/bridge.c:51:
./include/linux/pci_ids.h:2261:0: note: this is the location of the previous definition
#define PCI_DEVICE_ID_VMWARE_VMXNET3 0x07b0
^
/tmp/modconfig-doTtHI/vmnet-only/bridge.c: In function ‘VNetBridgeReceiveFromVNet’:
/tmp/modconfig-doTtHI/vmnet-only/bridge.c:639:14: error: passing argument 1 of ‘atomic_inc’ from incompatible pointer type [-Werror=incompatible-pointer-types]
atomic_inc(&clone->users);
^
In file included from ./include/linux/atomic.h:4:0,
from ./include/linux/rcupdate.h:38,
from ./include/linux/rculist.h:10,
from ./include/linux/pid.h:4,
from ./include/linux/sched.h:13,
from /tmp/modconfig-doTtHI/vmnet-only/bridge.c:25:
./arch/x86/include/asm/atomic.h:89:29: note: expected ‘atomic_t * {aka struct <anonymous> *}’ but argument is of type ‘refcount_t * {aka struct refcount_struct *}’
static __always_inline void atomic_inc(atomic_t *v)
^
In file included from ./include/linux/pci.h:36:0,
from /tmp/modconfig-doTtHI/vmnet-only/compat_netdevice.h:27,
from /tmp/modconfig-doTtHI/vmnet-only/netif.c:43:
./include/linux/pci_ids.h:2260:0: warning: "PCI_VENDOR_ID_VMWARE" redefined
#define PCI_VENDOR_ID_VMWARE 0x15ad
^
In file included from /tmp/modconfig-doTtHI/vmnet-only/net.h:38:0,
from /tmp/modconfig-doTtHI/vmnet-only/vnetInt.h:26,
from /tmp/modconfig-doTtHI/vmnet-only/netif.c:42:
/tmp/modconfig-doTtHI/vmnet-only/vm_device_version.h:56:0: note: this is the location of the previous definition
#define PCI_VENDOR_ID_VMWARE 0x15AD
^
In file included from ./include/linux/pci.h:36:0,
from /tmp/modconfig-doTtHI/vmnet-only/compat_netdevice.h:27,
from /tmp/modconfig-doTtHI/vmnet-only/netif.c:43:
./include/linux/pci_ids.h:2261:0: warning: "PCI_DEVICE_ID_VMWARE_VMXNET3" redefined
#define PCI_DEVICE_ID_VMWARE_VMXNET3 0x07b0
^
In file included from /tmp/modconfig-doTtHI/vmnet-only/net.h:38:0,
from /tmp/modconfig-doTtHI/vmnet-only/vnetInt.h:26,
from /tmp/modconfig-doTtHI/vmnet-only/netif.c:42:
/tmp/modconfig-doTtHI/vmnet-only/vm_device_version.h:73:0: note: this is the location of the previous definition
#define PCI_DEVICE_ID_VMWARE_VMXNET3 0x07B0
^
cc1: some warnings being treated as errors
scripts/Makefile.build:308: recipe for target '/tmp/modconfig-doTtHI/vmnet-only/userif.o' failed
make[2]: *** [/tmp/modconfig-doTtHI/vmnet-only/userif.o] Error 1
make[2]: *** Waiting for unfinished jobs....
cc1: some warnings being treated as errors
scripts/Makefile.build:308: recipe for target '/tmp/modconfig-doTtHI/vmnet-only/bridge.o' failed
make[2]: *** [/tmp/modconfig-doTtHI/vmnet-only/bridge.o] Error 1
Makefile:1550: recipe for target '_module_/tmp/modconfig-doTtHI/vmnet-only' failed
make[1]: *** [_module_/tmp/modconfig-doTtHI/vmnet-only] Error 2
make[1]: Leaving directory '/usr/src/linux-headers-4.13.0-32-generic'
Makefile:120: recipe for target 'vmnet.ko' failed
make: *** [vmnet.ko] Error 2
make: Leaving directory '/tmp/modconfig-doTtHI/vmnet-only'
Unable to install all modules. See log for details.




---------------------------------
log from vmware-x.log:
----------------------------------
2018-03-07T19:33:51.289+01:00| vthread-4| I125: Log for VMware Workstation pid=4321 version=12.5.3 build=build-5115892 option=Release
2018-03-07T19:33:51.289+01:00| vthread-4| I125: The process is 64-bit.
2018-03-07T19:33:51.289+01:00| vthread-4| I125: Host codepage=UTF-8 encoding=UTF-8
2018-03-07T19:33:51.289+01:00| vthread-4| I125: Host is Linux 4.13.0-32-generic Linux Mint 18.3 Sylvia
2018-03-07T19:33:51.288+01:00| vthread-4| I125: DictionaryLoad: Cannot open file "/usr/lib/vmware/settings": No such file or directory.
2018-03-07T19:33:51.288+01:00| vthread-4| I125: PREF Optional preferences file not found at /usr/lib/vmware/settings. Using default values.
2018-03-07T19:33:51.288+01:00| vthread-4| I125: DictionaryLoad: Cannot open file "/root/.vmware/config": No such file or directory.
2018-03-07T19:33:51.288+01:00| vthread-4| I125: PREF Optional preferences file not found at /root/.vmware/config. Using default values.
2018-03-07T19:33:51.288+01:00| vthread-4| I125: PREF Unable to check permissions for preferences file.
2018-03-07T19:33:51.288+01:00| vthread-4| I125: DictionaryLoad: Cannot open file "/root/.vmware/preferences": No such file or directory.
2018-03-07T19:33:51.288+01:00| vthread-4| I125: PREF Failed to load user preferences.
2018-03-07T19:33:51.353+01:00| vthread-4| W115: Logging to /tmp/vmware-root/vmware-4321.log
2018-03-07T19:33:51.370+01:00| vthread-4| I125: Obtaining info using the running kernel.
2018-03-07T19:33:51.370+01:00| vthread-4| I125: Created new pathsHash.
2018-03-07T19:33:51.370+01:00| vthread-4| I125: Setting header path for 4.13.0-32-generic to "/lib/modules/4.13.0-32-generic/build/include".
2018-03-07T19:33:51.370+01:00| vthread-4| I125: Validating path "/lib/modules/4.13.0-32-generic/build/include" for kernel release "4.13.0-32-generic".
2018-03-07T19:33:51.370+01:00| vthread-4| I125: Failed to find /lib/modules/4.13.0-32-generic/build/include/linux/version.h
2018-03-07T19:33:51.370+01:00| vthread-4| I125: /lib/modules/4.13.0-32-generic/build/include/linux/version.h not found, looking for generated/uapi/linux/version.h instead.
2018-03-07T19:33:51.370+01:00| vthread-4| I125: using /usr/bin/gcc for preprocess check
2018-03-07T19:33:51.379+01:00| vthread-4| I125: Preprocessed UTS_RELEASE, got value "4.13.0-32-generic".
2018-03-07T19:33:51.379+01:00| vthread-4| I125: The header path "/lib/modules/4.13.0-32-generic/build/include" for the kernel "4.13.0-32-generic" is valid. Whoohoo!
2018-03-07T19:33:51.556+01:00| vthread-4| I125: found symbol version file /lib/modules/4.13.0-32-generic/build/Module.symvers
2018-03-07T19:33:51.556+01:00| vthread-4| I125: Reading symbol versions from /lib/modules/4.13.0-32-generic/build/Module.symvers.
2018-03-07T19:33:51.590+01:00| vthread-4| I125: Read 22187 symbol versions
2018-03-07T19:33:51.590+01:00| vthread-4| I125: Reading in info for the vmmon module.
2018-03-07T19:33:51.590+01:00| vthread-4| I125: Reading in info for the vmnet module.
2018-03-07T19:33:51.590+01:00| vthread-4| I125: Reading in info for the vmblock module.
2018-03-07T19:33:51.590+01:00| vthread-4| I125: Reading in info for the vmci module.
2018-03-07T19:33:51.590+01:00| vthread-4| I125: Reading in info for the vsock module.
2018-03-07T19:33:51.590+01:00| vthread-4| I125: Setting vsock to depend on vmci.
2018-03-07T19:33:51.590+01:00| vthread-4| I125: Invoking modinfo on "vmmon".
2018-03-07T19:33:51.593+01:00| vthread-4| I125: "/sbin/modinfo" exited with status 256.
2018-03-07T19:33:51.593+01:00| vthread-4| I125: Invoking modinfo on "vmnet".
2018-03-07T19:33:51.595+01:00| vthread-4| I125: "/sbin/modinfo" exited with status 256.
2018-03-07T19:33:51.595+01:00| vthread-4| I125: Invoking modinfo on "vmblock".
2018-03-07T19:33:51.598+01:00| vthread-4| I125: "/sbin/modinfo" exited with status 256.
2018-03-07T19:33:51.598+01:00| vthread-4| I125: Invoking modinfo on "vmci".
2018-03-07T19:33:51.600+01:00| vthread-4| I125: "/sbin/modinfo" exited with status 256.
2018-03-07T19:33:51.600+01:00| vthread-4| I125: Invoking modinfo on "vsock".
2018-03-07T19:33:51.603+01:00| vthread-4| I125: "/sbin/modinfo" exited with status 0.
2018-03-07T19:33:51.625+01:00| vthread-4| I125: to be installed: vmmon status: 0
2018-03-07T19:33:51.625+01:00| vthread-4| I125: to be installed: vmnet status: 0
2018-03-07T19:33:51.654+01:00| vthread-4| I125: Obtaining info using the running kernel.
2018-03-07T19:33:51.654+01:00| vthread-4| I125: Setting header path for 4.13.0-32-generic to "/lib/modules/4.13.0-32-generic/build/include".
2018-03-07T19:33:51.654+01:00| vthread-4| I125: Validating path "/lib/modules/4.13.0-32-generic/build/include" for kernel release "4.13.0-32-generic".
2018-03-07T19:33:51.654+01:00| vthread-4| I125: Failed to find /lib/modules/4.13.0-32-generic/build/include/linux/version.h
2018-03-07T19:33:51.654+01:00| vthread-4| I125: /lib/modules/4.13.0-32-generic/build/include/linux/version.h not found, looking for generated/uapi/linux/version.h instead.
2018-03-07T19:33:51.654+01:00| vthread-4| I125: using /usr/bin/gcc for preprocess check
2018-03-07T19:33:51.663+01:00| vthread-4| I125: Preprocessed UTS_RELEASE, got value "4.13.0-32-generic".
2018-03-07T19:33:51.663+01:00| vthread-4| I125: The header path "/lib/modules/4.13.0-32-generic/build/include" for the kernel "4.13.0-32-generic" is valid. Whoohoo!
2018-03-07T19:33:51.838+01:00| vthread-4| I125: found symbol version file /lib/modules/4.13.0-32-generic/build/Module.symvers
2018-03-07T19:33:51.839+01:00| vthread-4| I125: Reading symbol versions from /lib/modules/4.13.0-32-generic/build/Module.symvers.
2018-03-07T19:33:51.872+01:00| vthread-4| I125: Read 22187 symbol versions
2018-03-07T19:33:51.873+01:00| vthread-4| I125: Kernel header path retrieved from FileEntry: /lib/modules/4.13.0-32-generic/build/include
2018-03-07T19:33:51.873+01:00| vthread-4| I125: Update kernel header path to /lib/modules/4.13.0-32-generic/build/include
2018-03-07T19:33:51.873+01:00| vthread-4| I125: Validating path "/lib/modules/4.13.0-32-generic/build/include" for kernel release "4.13.0-32-generic".
2018-03-07T19:33:51.873+01:00| vthread-4| I125: Failed to find /lib/modules/4.13.0-32-generic/build/include/linux/version.h
2018-03-07T19:33:51.873+01:00| vthread-4| I125: /lib/modules/4.13.0-32-generic/build/include/linux/version.h not found, looking for generated/uapi/linux/version.h instead.
2018-03-07T19:33:51.873+01:00| vthread-4| I125: using /usr/bin/gcc for preprocess check
2018-03-07T19:33:51.882+01:00| vthread-4| I125: Preprocessed UTS_RELEASE, got value "4.13.0-32-generic".
2018-03-07T19:33:51.882+01:00| vthread-4| I125: The header path "/lib/modules/4.13.0-32-generic/build/include" for the kernel "4.13.0-32-generic" is valid. Whoohoo!
2018-03-07T19:33:51.884+01:00| vthread-4| I125: Found compiler at "/usr/bin/gcc"
2018-03-07T19:33:51.887+01:00| vthread-4| I125: Got gcc version "5.4.0".
2018-03-07T19:33:51.887+01:00| vthread-4| I125: The GCC version matches the kernel GCC minor version like a glove.
2018-03-07T19:33:51.888+01:00| vthread-4| I125: Using user supplied compiler "/usr/bin/gcc".
2018-03-07T19:33:51.891+01:00| vthread-4| I125: Got gcc version "5.4.0".
2018-03-07T19:33:51.891+01:00| vthread-4| I125: The GCC version matches the kernel GCC minor version like a glove.
2018-03-07T19:33:51.893+01:00| vthread-4| I125: Trying to find a suitable PBM set for kernel "4.13.0-32-generic".
2018-03-07T19:33:51.893+01:00| vthread-4| I125: No matching PBM set was found for kernel "4.13.0-32-generic".
2018-03-07T19:33:51.893+01:00| vthread-4| I125: The GCC version matches the kernel GCC minor version like a glove.
2018-03-07T19:33:51.893+01:00| vthread-4| I125: Validating path "/lib/modules/4.13.0-32-generic/build/include" for kernel release "4.13.0-32-generic".
2018-03-07T19:33:51.893+01:00| vthread-4| I125: Failed to find /lib/modules/4.13.0-32-generic/build/include/linux/version.h
2018-03-07T19:33:51.893+01:00| vthread-4| I125: /lib/modules/4.13.0-32-generic/build/include/linux/version.h not found, looking for generated/uapi/linux/version.h instead.
2018-03-07T19:33:51.893+01:00| vthread-4| I125: using /usr/bin/gcc for preprocess check
2018-03-07T19:33:51.902+01:00| vthread-4| I125: Preprocessed UTS_RELEASE, got value "4.13.0-32-generic".
2018-03-07T19:33:51.902+01:00| vthread-4| I125: The header path "/lib/modules/4.13.0-32-generic/build/include" for the kernel "4.13.0-32-generic" is valid. Whoohoo!
2018-03-07T19:33:51.904+01:00| vthread-4| I125: The GCC version matches the kernel GCC minor version like a glove.
2018-03-07T19:33:51.904+01:00| vthread-4| I125: Validating path "/lib/modules/4.13.0-32-generic/build/include" for kernel release "4.13.0-32-generic".
2018-03-07T19:33:51.904+01:00| vthread-4| I125: Failed to find /lib/modules/4.13.0-32-generic/build/include/linux/version.h
2018-03-07T19:33:51.904+01:00| vthread-4| I125: /lib/modules/4.13.0-32-generic/build/include/linux/version.h not found, looking for generated/uapi/linux/version.h instead.
2018-03-07T19:33:51.904+01:00| vthread-4| I125: using /usr/bin/gcc for preprocess check
2018-03-07T19:33:51.912+01:00| vthread-4| I125: Preprocessed UTS_RELEASE, got value "4.13.0-32-generic".
2018-03-07T19:33:51.912+01:00| vthread-4| I125: The header path "/lib/modules/4.13.0-32-generic/build/include" for the kernel "4.13.0-32-generic" is valid. Whoohoo!
2018-03-07T19:33:51.912+01:00| vthread-4| I125: Using temp dir "/tmp".
2018-03-07T19:33:51.914+01:00| vthread-4| I125: Obtaining info using the running kernel.
2018-03-07T19:33:51.914+01:00| vthread-4| I125: Setting header path for 4.13.0-32-generic to "/lib/modules/4.13.0-32-generic/build/include".
2018-03-07T19:33:51.914+01:00| vthread-4| I125: Validating path "/lib/modules/4.13.0-32-generic/build/include" for kernel release "4.13.0-32-generic".
2018-03-07T19:33:51.914+01:00| vthread-4| I125: Failed to find /lib/modules/4.13.0-32-generic/build/include/linux/version.h
2018-03-07T19:33:51.914+01:00| vthread-4| I125: /lib/modules/4.13.0-32-generic/build/include/linux/version.h not found, looking for generated/uapi/linux/version.h instead.
2018-03-07T19:33:51.914+01:00| vthread-4| I125: using /usr/bin/gcc for preprocess check
2018-03-07T19:33:51.922+01:00| vthread-4| I125: Preprocessed UTS_RELEASE, got value "4.13.0-32-generic".
2018-03-07T19:33:51.922+01:00| vthread-4| I125: The header path "/lib/modules/4.13.0-32-generic/build/include" for the kernel "4.13.0-32-generic" is valid. Whoohoo!
2018-03-07T19:33:52.099+01:00| vthread-4| I125: found symbol version file /lib/modules/4.13.0-32-generic/build/Module.symvers
2018-03-07T19:33:52.099+01:00| vthread-4| I125: Reading symbol versions from /lib/modules/4.13.0-32-generic/build/Module.symvers.
2018-03-07T19:33:52.131+01:00| vthread-4| I125: Read 22187 symbol versions
2018-03-07T19:33:52.131+01:00| vthread-4| I125: Invoking modinfo on "vmmon".
2018-03-07T19:33:52.134+01:00| vthread-4| I125: "/sbin/modinfo" exited with status 256.
2018-03-07T19:33:52.134+01:00| vthread-4| I125: Invoking modinfo on "vmnet".
2018-03-07T19:33:52.136+01:00| vthread-4| I125: "/sbin/modinfo" exited with status 256.
2018-03-07T19:33:52.340+01:00| vthread-4| I125: Setting destination path for vmmon to "/lib/modules/4.13.0-32-generic/misc/vmmon.ko".
2018-03-07T19:33:52.340+01:00| vthread-4| I125: Extracting the vmmon source from "/usr/lib/vmware/modules/source/vmmon.tar".
2018-03-07T19:33:52.350+01:00| vthread-4| I125: Successfully extracted the vmmon source.
2018-03-07T19:33:52.350+01:00| vthread-4| I125: Building module with command "/usr/bin/make -j24 -C /tmp/modconfig-CKCSOV/vmmon-only auto-build HEADER_DIR=/lib/modules/4.13.0-32-generic/build/include CC=/usr/bin/gcc IS_GCC_3=no"
2018-03-07T19:33:54.349+01:00| vthread-4| W115: Failed to build vmmon. Failed to execute the build command.
2018-03-07T19:33:54.351+01:00| vthread-4| I125: Setting destination path for vmnet to "/lib/modules/4.13.0-32-generic/misc/vmnet.ko".
2018-03-07T19:33:54.351+01:00| vthread-4| I125: Extracting the vmnet source from "/usr/lib/vmware/modules/source/vmnet.tar".
2018-03-07T19:33:54.359+01:00| vthread-4| I125: Successfully extracted the vmnet source.
2018-03-07T19:33:54.359+01:00| vthread-4| I125: Building module with command "/usr/bin/make -j24 -C /tmp/modconfig-CKCSOV/vmnet-only auto-build HEADER_DIR=/lib/modules/4.13.0-32-generic/build/include CC=/usr/bin/gcc IS_GCC_3=no"
2018-03-07T19:34:00.690+01:00| vthread-4| W115: Failed to build vmnet. Failed to execute the build command.

Post Reply

Return to “Software & Applications”